Type assignment
preferred label: Típus hozzárendelés @hu
preferred label: классификация @ru
preferred label: класифициране @bg
editing state: Finalized
in scheme: eventType
definition: **Type assignment**, as a value for the LIDO [**Event Type**](https://lido-schema.org/schema/latest/lido.html#eventType "LIDO Schema Documentation Version 1.1") element, designates an activity of classifying items of whatever kind, but may also be applied to people, actions and concepts. Object classifications include both the scientific determination of a natural history specimen, and the typification of intangible and tangible cultural assets on the basis of certain congruent characteristics for demarcation and hierarchical order. [Based on CIDOC-CRM ["E17 Type Assignment"](http://cidoc-crm.org/html/cidoc_crm_v7.1.1_with_translations.html#E17 "Scope Note for 'E17 Type Assignment' in version 7.1.1")]
preferred label: τύπος ανάθεση @el
preferred label: Rangú de réir cineáil @ga
preferred label: Přiřazení typu @cs
preferred label: Kategoribestemmelse @no
preferred label: Doloćitev tipa @sl
preferred label: Sklasyfikowanie @pl
type: Concept
preferred label: Type bepaling @nl
licence: http://creativecommons.org/licenses/by/4.0/
status: Approved
broader: lido00024
preferred label: Assignació de tipus @ca
is member of concept group: lido01101
preferred label: Tüübi määramine @et
modified: 2025-04-25T19:07:23+02:00
preferred label: Asignación de tipo @es
preferred label: Classificazione @it
preferred label: Affectation de type @fr
preferred label: dodjela tipa @hr
definition: **Typuszuweisung**, als Wert für das LIDO [**Ereignistyp**](https://lido-schema.org/schema/latest/lido.html#eventType "LIDO Schema Documentation Version 1.1")-Element, bezeichnet eine Aktivität der Klassifizierung von Objekten jeglicher Art. Solche Aktivitäten werden typischerweise auf Objekte angewandt, können aber auch auf Personen, Handlungen und Konzepte angewandt werden. Objektklassifizierungen umfassen sowohl die wissenschaftliche Bestimmung eines naturwissenschaftlichen Exemplars, als auch die Typisierung von immateriellen und materiellen Kulturgütern anhand bestimmter übereinstimmender Merkmale, die zur Abgrenzung und hierarchischen Ordnung verwendet werden. [Auf der Basis von CIDOC-CRM ["E17 Type Assignment"](http://cidoc-crm.org/html/cidoc_crm_v7.1.1_with_translations.html#E17 "Scope Note for 'E17 Type Assignment' in version 7.1.1")] @de
scope note: **Type assignment** is used for the documentation of both, the results and the context of classification activities in cases where the value of the classification depends on the mindset of the classifier, and the period the classification was made. In the context of LIDO such activity typically relates to the LIDO [Object/Work Type](https://lido-schema.org/schema/latest/lido.html#objectWorkType "LIDO Schema Documentation Version 1.1") and the LIDO [Classification](https://lido-schema.org/schema/latest/lido.html#classification "LIDO Schema Documentation Version 1.1") element. [Based on CIDOC-CRM ["E17 Type Assignment"](http://cidoc-crm.org/html/cidoc_crm_v7.1.1_with_translations.html#E17 "Scope Note for 'E17 Type Assignment' in version 7.1.1")]
preferred label: Atribuição de tipo @pt
preferred label: Tipu piešķiršana @lv
alternative label: присвоение типа @ru
preferred label: Typuszuweisung @de
is member of concept group: lido01029
alias: type assignment
preferred label: סיווג @he
scope note: **Typuszuweisung** wird für die Dokumentation der Ergebnisse und des Kontextes (Person, Ort, Zeit) von Klassifikationsaktivitäten verwendet um zu verdeutlichen, dass der Wert der Klassifikation von der Denkweise des Klassifikators und dem Zeitraum, in dem die Klassifizierung vorgenommen wurde, abhängt. Im Kontext von LIDO bezieht sich eine solche Aktivität in der Regel auf das LIDO [Classification](https://lido-schema.org/schema/latest/lido.html#classification) Element. [Auf der Basis von CIDOC-CRM ["E17 Type Assignment"](http://cidoc-crm.org/html/cidoc_crm_v7.1.1_with_translations.html#E17 "Scope Note for 'E17 Type Assignment' in version 7.1.1")] @de
preferred label: Kategoribestämning @sv